Target
Proteasome subunit beta type-1
Ligand
BDBM50444888
Substrate
Meas. Tech.
ChEMBL_1282980 (CHEMBL3100299)
Ki
1020±n/a nM
Citation
 Hasegawa, MYasuda, YTanaka, MNakata, KUmeda, EWang, YWatanabe, CUetake, SKunoh, TShionyu, MSasaki, RShiina, IMizukami, T A novel tamoxifen derivative, ridaifen-F, is a nonpeptidic small-molecule proteasome inhibitor. Eur J Med Chem 71:290-305 (2014)  
Target
Name:
Proteasome subunit beta type-1
Synonyms:
PSB1_HUMAN PSMB1 Proteasome subunit beta type-1/beta type-5
Type:
PROTEIN
Mol. Mass.:
26493.62
Organism:
Homo sapiens (Human)
Description:
ChEMBL_1366691
Residue:
241
  
Inhibitor
Name:
BDBM50444888
Synonyms:
CHEMBL3099621
Type:
Small organic molecule
Emp. Form.:
C42H50N2O2
Mol. Mass.:
614.8586
SMILES:
[#6](-[#6]-[#7]-1-[#6]-[#6]-[#6]-[#6]-[#6]-[#6]-1)-[#8]-c1ccc(cc1)-[#6](=[#6](\c1ccccc1)-c1ccccc1)\c1ccc(-[#8]-[#6]-[#6]-[#7]-2-[#6]-[#6]-[#6]-[#6]-[#6]-[#6]-2)cc1
: