Target
Proteasome subunit beta type-5
Ligand
BDBM50444908
Substrate
Meas. Tech.
ChEMBL_1282981 (CHEMBL3100300)
Ki
870±n/a nM
Citation
 Hasegawa, MYasuda, YTanaka, MNakata, KUmeda, EWang, YWatanabe, CUetake, SKunoh, TShionyu, MSasaki, RShiina, IMizukami, T A novel tamoxifen derivative, ridaifen-F, is a nonpeptidic small-molecule proteasome inhibitor. Eur J Med Chem 71:290-305 (2014)  
Target
Name:
Proteasome subunit beta type-5
Synonyms:
20S proteasome chymotrypsin-like LMPX PSB5_HUMAN Proteasome Macropain subunit MB1 X
Type:
Protein
Mol. Mass.:
28480.96
Organism:
Homo sapiens (Human)
Description:
Residue:
263
  
Inhibitor
Name:
BDBM50444908
Synonyms:
CHEMBL3099624
Type:
Small organic molecule
Emp. Form.:
C36H46N2O2
Mol. Mass.:
538.7626
SMILES:
[#6](-[#6]-[#7]-1-[#6]-[#6]-[#6]-[#6]-[#6]-[#6]-1)-[#8]-c1ccc(cc1)-[#6](=[#6]/c1ccccc1)\c1ccc(-[#8]-[#6]-[#6]-[#7]-2-[#6]-[#6]-[#6]-[#6]-[#6]-[#6]-2)cc1
: