Target
Mineralocorticoid receptor
Ligand
BDBM50448168
Substrate
Meas. Tech.
ChEMBL_1292841 (CHEMBL3122505)
Ki
6.1±n/a nM
Citation
 Carson, MWLuz, JGSuen, CMontrose, CZink, RRuan, XCheng, CCole, HAdrian, MDKohlman, DTMabry, TSnyder, NCondon, BMaletic, MClawson, DPustilnik, ACoghlan, MJ Glucocorticoid receptor modulators informed by crystallography lead to a new rationale for receptor selectivity, function, and implications for structure-based design. J Med Chem 57:849-60 (2014)  
Target
Name:
Mineralocorticoid receptor
Synonyms:
MCR MLR NR3C2 | Nuclear receptor subfamily 3 group C member 2
Type:
Enzyme
Mol. Mass.:
107076.42
Organism:
Homo sapiens (Human)
Description:
P08235
Residue:
984
  
Inhibitor
Name:
BDBM50448168
Synonyms:
CHEMBL3120317
Type:
Small organic molecule
Emp. Form.:
C25H25NO4S
Mol. Mass.:
435.535
SMILES:
CC\C(c1cccc(NS(C)(=O)=O)c1)=C1/c2ccccc2OCc2cccc(OC)c12
: