Target
Fatty-acid amide hydrolase 1 [30-579]
Ligand
BDBM50021329
Substrate
Meas. Tech.
ChEMBL_1366316 (CHEMBL3295962)
IC50
21±n/a nM
Citation
 Chobanian, HRGuo, YLiu, PChioda, MDFung, SLanza, TJChang, LBakshi, RKDellureficio, JPHong, QMcLaughlin, MBelyk, KMKrska, SWMakarewicz, AKMartel, EJLeone, JFFrey, LKaranam, BMadeira, MAlvaro, RShuman, JSalituro, GTerebetski, JLJochnowitz, NMistry, SMcGowan, EHajdu, RRosenbach, MAbbadie, CAlexander, JPShiao, LLSullivan, KMNargund, RPWyvratt, MJLin, LSDeVita, RJ Discovery of MK-4409, a Novel Oxazole FAAH Inhibitor for the Treatment of Inflammatory and Neuropathic Pain. ACS Med Chem Lett 5:717-21 (2014)  
Target
Name:
Fatty-acid amide hydrolase 1 [30-579]
Synonyms:
Anandamide amidohydrolase 1 Faah Fatty Acid Amide Hydrolase Fatty-acid amide hydrolase (FAAH) Fatty-acid amide hydrolase 1 (FAAH) Oleamide hydrolase 1
Type:
Single-pass membrane protein; homodimer
Mol. Mass.:
60474.00
Organism:
Rattus norvegicus (rat)
Description:
P97612 (aa 30-579)
Residue:
550
  
Inhibitor
Name:
BDBM50021329
Synonyms:
CHEMBL3287932
Type:
Small organic molecule
Emp. Form.:
C21H14ClFN2O3S2
Mol. Mass.:
460.929
SMILES:
CS(=O)(=O)c1ccc(cc1)-c1nc(oc1Sc1ccc(Cl)cn1)-c1ccc(F)cc1
: