Target
Fatty-acid amide hydrolase 1
Ligand
BDBM50021329
Substrate
Meas. Tech.
ChEMBL_1366315 (CHEMBL3295961)
IC50
28±n/a nM
Citation
 Chobanian, HRGuo, YLiu, PChioda, MDFung, SLanza, TJChang, LBakshi, RKDellureficio, JPHong, QMcLaughlin, MBelyk, KMKrska, SWMakarewicz, AKMartel, EJLeone, JFFrey, LKaranam, BMadeira, MAlvaro, RShuman, JSalituro, GTerebetski, JLJochnowitz, NMistry, SMcGowan, EHajdu, RRosenbach, MAbbadie, CAlexander, JPShiao, LLSullivan, KMNargund, RPWyvratt, MJLin, LSDeVita, RJ Discovery of MK-4409, a Novel Oxazole FAAH Inhibitor for the Treatment of Inflammatory and Neuropathic Pain. ACS Med Chem Lett 5:717-21 (2014)  
Target
Name:
Fatty-acid amide hydrolase 1
Synonyms:
Anandamide amidohydrolase FAAH FAAH1_HUMAN Fatty-acid amide hydrolase (FAAH) Oleamide hydrolase 1
Type:
Protein
Mol. Mass.:
63071.19
Organism:
Homo sapiens (Human)
Description:
O00519
Residue:
579
  
Inhibitor
Name:
BDBM50021329
Synonyms:
CHEMBL3287932
Type:
Small organic molecule
Emp. Form.:
C21H14ClFN2O3S2
Mol. Mass.:
460.929
SMILES:
CS(=O)(=O)c1ccc(cc1)-c1nc(oc1Sc1ccc(Cl)cn1)-c1ccc(F)cc1
: