Target
Fatty-acid amide hydrolase 1
Ligand
BDBM50021331
Substrate
Meas. Tech.
ChEMBL_1366315 (CHEMBL3295961)
IC50
32±n/a nM
Citation
 Chobanian, HRGuo, YLiu, PChioda, MDFung, SLanza, TJChang, LBakshi, RKDellureficio, JPHong, QMcLaughlin, MBelyk, KMKrska, SWMakarewicz, AKMartel, EJLeone, JFFrey, LKaranam, BMadeira, MAlvaro, RShuman, JSalituro, GTerebetski, JLJochnowitz, NMistry, SMcGowan, EHajdu, RRosenbach, MAbbadie, CAlexander, JPShiao, LLSullivan, KMNargund, RPWyvratt, MJLin, LSDeVita, RJ Discovery of MK-4409, a Novel Oxazole FAAH Inhibitor for the Treatment of Inflammatory and Neuropathic Pain. ACS Med Chem Lett 5:717-21 (2014)  
Target
Name:
Fatty-acid amide hydrolase 1
Synonyms:
Anandamide amidohydrolase FAAH FAAH1_HUMAN Fatty-acid amide hydrolase (FAAH) Oleamide hydrolase 1
Type:
Protein
Mol. Mass.:
63071.19
Organism:
Homo sapiens (Human)
Description:
O00519
Residue:
579
  
Inhibitor
Name:
BDBM50021331
Synonyms:
CHEMBL3287930
Type:
Small organic molecule
Emp. Form.:
C22H18ClFN4OS
Mol. Mass.:
440.921
SMILES:
CC(C)(O)c1cnc(cn1)-c1nn(cc1Sc1ccc(Cl)cc1)-c1ccc(F)cc1
: