Target
Platelet-derived growth factor receptor beta
Ligand
BDBM50022522
Substrate
Meas. Tech.
ChEMBL_1368206 (CHEMBL3299342)
IC50
27±n/a nM
Citation
 Zhang, XRaghavan, SIhnat, MThorpe, JEDisch, BCBastian, ABailey-Downs, LCDybdal-Hargreaves, NFRohena, CCHamel, EMooberry, SLGangjee, A The design and discovery of water soluble 4-substituted-2,6-dimethylfuro[2,3-d]pyrimidines as multitargeted receptor tyrosine kinase inhibitors and microtubule targeting antitumor agents. Bioorg Med Chem 22:3753-72 (2014)  
Target
Name:
Platelet-derived growth factor receptor beta
Synonyms:
Beta-type platelet-derived growth factor receptor CD140b antigen PDGF Receptor Substrate PDGFR PDGFR-1 PDGFRB PGFRB_HUMAN Platelet-derived growth factor receptor 1 Platelet-derived growth factor receptor beta (PDGFR-beta) Platelet-derived growth factor receptor beta (PDGFRbeta) | VHL/PDGFRB
Type:
Enzyme
Mol. Mass.:
123922.25
Organism:
Homo sapiens (Human)
Description:
P09619
Residue:
1106
  
Inhibitor
Name:
BDBM50022522
Synonyms:
CHEMBL3297899
Type:
Small organic molecule
Emp. Form.:
C17H19N3O2
Mol. Mass.:
297.3517
SMILES:
CCN(c1ccc(OC)cc1)c1nc(C)nc2oc(C)cc12
: