Target
Integrin alpha-V/beta-5
Ligand
BDBM50107402
Substrate
Meas. Tech.
ChEMBL_1367911 (CHEMBL3300520)
IC50
38000±n/a nM
Citation
 Hegemann, JDDe Simone, MZimmermann, MKnappe, TAXie, XDi Leva, FSMarinelli, LNovellino, EZahler, SKessler, HMarahiel, MA Rational improvement of the affinity and selectivity of integrin binding of grafted lasso peptides. J Med Chem 57:5829-34 (2014)  
Target
Name:
Integrin alpha-V/beta-5
Synonyms:
ITGAV/ITGB5 | Integrin beta-5/Vitronectin receptor alpha
Type:
Enzyme
Mol. Mass.:
Description:
Components:
This complex has 2 components.
Component 1
Name:
Integrin alpha-V
Synonyms:
ITAV_HUMAN Integrin alpha-V/alpha-5 VNRA Vitronectin receptor | Vitronectin receptor subunit alpha
Type:
PROTEIN
Mol. Mass.:
116024.92
Organism:
Homo sapiens (Human)
Description:
ChEMBL_582336
Residue:
1048
  
Component 2
Name:
Integrin beta-5
Synonyms:
ITB5_HUMAN | ITGB5
Type:
PROTEIN
Mol. Mass.:
88047.37
Organism:
Homo sapiens (Human)
Description:
EBI_10915
Residue:
799
  
Inhibitor
Name:
BDBM50107402
Synonyms:
(S)-2-[2-((S)-2-Amino-5-carbamimidoyl-pentanoylamino)-acetylamino]-succinic acid 2-[2-(2-Amino-5-guanidino-pentanoylamino)-acetylamino]-succinic acid(RGD) | CHEMBL313763
Type:
Small organic molecule
Emp. Form.:
C12H22N6O6
Mol. Mass.:
346.3397
SMILES:
N[C@@H](CCCNC(N)=N)C(=O)NCC(=O)N[C@@H](CC(O)=O)C(O)=O
: