Target
Integrin alpha-V/beta-5
Ligand
BDBM50003851
Substrate
Meas. Tech.
ChEMBL_1367911 (CHEMBL3300520)
IC50
92000±n/a nM
Citation
 Hegemann, JDDe Simone, MZimmermann, MKnappe, TAXie, XDi Leva, FSMarinelli, LNovellino, EZahler, SKessler, HMarahiel, MA Rational improvement of the affinity and selectivity of integrin binding of grafted lasso peptides. J Med Chem 57:5829-34 (2014)  
Target
Name:
Integrin alpha-V/beta-5
Synonyms:
ITGAV/ITGB5 | Integrin beta-5/Vitronectin receptor alpha
Type:
Enzyme
Mol. Mass.:
Description:
Components:
This complex has 2 components.
Component 1
Name:
Integrin alpha-V
Synonyms:
ITAV_HUMAN Integrin alpha-V/alpha-5 VNRA Vitronectin receptor | Vitronectin receptor subunit alpha
Type:
PROTEIN
Mol. Mass.:
116024.92
Organism:
Homo sapiens (Human)
Description:
ChEMBL_582336
Residue:
1048
  
Component 2
Name:
Integrin beta-5
Synonyms:
ITB5_HUMAN | ITGB5
Type:
PROTEIN
Mol. Mass.:
88047.37
Organism:
Homo sapiens (Human)
Description:
EBI_10915
Residue:
799
  
Inhibitor
Name:
BDBM50003851
Synonyms:
(6S,12S,15S)-1,6-diamino-15-benzyl-12-(carboxymethyl)-1-imino-7,10,13-trioxo-2,8,11,14-tetraazahexadecan-16-oic acid 1-({[2-Carboxy-1-(1-carboxy-2-phenyl-ethylcarbamoyl)-ethylcarbamoyl]-methyl}-carbamoyl)-4-(diaminomethyl-amino)-butyl-ammonium(Arg-Gly-Asp-Phe) CHEMBL303561
Type:
Small organic molecule
Emp. Form.:
C21H31N7O7
Mol. Mass.:
493.5135
SMILES:
[#7]-[#6@@H](-[#6]-[#6]-[#6]\[#7]=[#6](/[#7])-[#7])-[#6](=O)-[#7]-[#6]-[#6](=O)-[#7]-[#6@@H](-[#6]-[#6](-[#8])=O)-[#6](=O)-[#7]-[#6@@H](-[#6]-c1ccccc1)-[#6](-[#8])=O
: