Target
Integrin alpha-5/beta-1
Ligand
BDBM50107402
Substrate
Meas. Tech.
ChEMBL_1367912 (CHEMBL3300521)
IC50
830000±n/a nM
Citation
 Hegemann, JDDe Simone, MZimmermann, MKnappe, TAXie, XDi Leva, FSMarinelli, LNovellino, EZahler, SKessler, HMarahiel, MA Rational improvement of the affinity and selectivity of integrin binding of grafted lasso peptides. J Med Chem 57:5829-34 (2014)  
Target
Name:
Integrin alpha-5/beta-1
Synonyms:
Fibronectin receptor alpha/beta ITGA5/ITGB1
Type:
Enzyme
Mol. Mass.:
Description:
Components:
This complex has 2 components.
Component 1
Name:
Integrin alpha-5
Synonyms:
CD49 antigen-like family member E FNRA Fibronectin receptor subunit alpha ITGA5 Integrin alpha-F | VLA-5
Type:
Single-pass type I membrane protein
Mol. Mass.:
114523.00
Organism:
Homo sapiens (Human)
Description:
Residue:
1049
  
Component 2
Name:
Integrin beta-1
Synonyms:
CD_antigen=CD29 Fibronectin receptor beta GPIIA ITGB1 MDF2 | MSK12
Type:
Enzyme
Mol. Mass.:
88400.38
Organism:
Homo sapiens (Human)
Description:
P05556
Residue:
798
  
Inhibitor
Name:
BDBM50107402
Synonyms:
(S)-2-[2-((S)-2-Amino-5-carbamimidoyl-pentanoylamino)-acetylamino]-succinic acid 2-[2-(2-Amino-5-guanidino-pentanoylamino)-acetylamino]-succinic acid(RGD) | CHEMBL313763
Type:
Small organic molecule
Emp. Form.:
C12H22N6O6
Mol. Mass.:
346.3397
SMILES:
N[C@@H](CCCNC(N)=N)C(=O)NCC(=O)N[C@@H](CC(O)=O)C(O)=O
: