Target
Integrin alpha-5/beta-1
Ligand
BDBM50003851
Substrate
Meas. Tech.
ChEMBL_1367912 (CHEMBL3300521)
IC50
1546000±n/a nM
Citation
 Hegemann, JDDe Simone, MZimmermann, MKnappe, TAXie, XDi Leva, FSMarinelli, LNovellino, EZahler, SKessler, HMarahiel, MA Rational improvement of the affinity and selectivity of integrin binding of grafted lasso peptides. J Med Chem 57:5829-34 (2014)  
Target
Name:
Integrin alpha-5/beta-1
Synonyms:
Fibronectin receptor alpha/beta ITGA5/ITGB1
Type:
Enzyme
Mol. Mass.:
Description:
Components:
This complex has 2 components.
Component 1
Name:
Integrin alpha-5
Synonyms:
CD49 antigen-like family member E FNRA Fibronectin receptor subunit alpha ITGA5 Integrin alpha-F | VLA-5
Type:
Single-pass type I membrane protein
Mol. Mass.:
114523.00
Organism:
Homo sapiens (Human)
Description:
Residue:
1049
  
Component 2
Name:
Integrin beta-1
Synonyms:
CD_antigen=CD29 Fibronectin receptor beta GPIIA ITGB1 MDF2 | MSK12
Type:
Enzyme
Mol. Mass.:
88400.38
Organism:
Homo sapiens (Human)
Description:
P05556
Residue:
798
  
Inhibitor
Name:
BDBM50003851
Synonyms:
(6S,12S,15S)-1,6-diamino-15-benzyl-12-(carboxymethyl)-1-imino-7,10,13-trioxo-2,8,11,14-tetraazahexadecan-16-oic acid 1-({[2-Carboxy-1-(1-carboxy-2-phenyl-ethylcarbamoyl)-ethylcarbamoyl]-methyl}-carbamoyl)-4-(diaminomethyl-amino)-butyl-ammonium(Arg-Gly-Asp-Phe) CHEMBL303561
Type:
Small organic molecule
Emp. Form.:
C21H31N7O7
Mol. Mass.:
493.5135
SMILES:
[#7]-[#6@@H](-[#6]-[#6]-[#6]\[#7]=[#6](/[#7])-[#7])-[#6](=O)-[#7]-[#6]-[#6](=O)-[#7]-[#6@@H](-[#6]-[#6](-[#8])=O)-[#6](=O)-[#7]-[#6@@H](-[#6]-c1ccccc1)-[#6](-[#8])=O
: