Target
Integrin alpha-5/beta-1
Ligand
BDBM50235980
Substrate
Meas. Tech.
ChEMBL_1367912 (CHEMBL3300521)
IC50
10100±n/a nM
Citation
 Hegemann, JDDe Simone, MZimmermann, MKnappe, TAXie, XDi Leva, FSMarinelli, LNovellino, EZahler, SKessler, HMarahiel, MA Rational improvement of the affinity and selectivity of integrin binding of grafted lasso peptides. J Med Chem 57:5829-34 (2014)  
Target
Name:
Integrin alpha-5/beta-1
Synonyms:
Fibronectin receptor alpha/beta ITGA5/ITGB1
Type:
Enzyme
Mol. Mass.:
Description:
Components:
This complex has 2 components.
Component 1
Name:
Integrin alpha-5
Synonyms:
CD49 antigen-like family member E FNRA Fibronectin receptor subunit alpha ITGA5 Integrin alpha-F | VLA-5
Type:
Single-pass type I membrane protein
Mol. Mass.:
114523.00
Organism:
Homo sapiens (Human)
Description:
Residue:
1049
  
Component 2
Name:
Integrin beta-1
Synonyms:
CD_antigen=CD29 Fibronectin receptor beta GPIIA ITGB1 MDF2 | MSK12
Type:
Enzyme
Mol. Mass.:
88400.38
Organism:
Homo sapiens (Human)
Description:
P05556
Residue:
798
  
Inhibitor
Name:
BDBM50235980
Synonyms:
2-((2S,5R,8S,11S)-5-benzyl-11-(3-guanidinopropyl)-8-isopropyl-7-methyl-3,6,9,12,15-pentaoxo-1,4,7,10,13-pentaazacyclopentadecan-2-yl)acetic acid CILENGITIDE EMD-121974 c(RGDfMeV) | cyclo(Arg-Gly-Asp-D-Phe-[N-Me]Val)
Type:
Small organic molecule
Emp. Form.:
C27H40N8O7
Mol. Mass.:
588.6559
SMILES:
[#6]-[#6](-[#6])-[#6@@H]-1-[#7](-[#6])-[#6](=O)-[#6@@H](-[#6]-c2ccccc2)-[#7]-[#6](=O)-[#6@H](-[#6]-[#6](-[#8])=O)-[#7]-[#6](=O)-[#6]-[#7]-[#6](=O)-[#6@H](-[#6]-[#6]-[#6]\[#7]=[#6](\[#7])-[#7])-[#7]-[#6]-1=O
: