Target
Integrin alpha-IIb/beta-3
Ligand
BDBM50107402
Substrate
Meas. Tech.
ChEMBL_1367913 (CHEMBL3300522)
IC50
130000±n/a nM
Citation
 Hegemann, JDDe Simone, MZimmermann, MKnappe, TAXie, XDi Leva, FSMarinelli, LNovellino, EZahler, SKessler, HMarahiel, MA Rational improvement of the affinity and selectivity of integrin binding of grafted lasso peptides. J Med Chem 57:5829-34 (2014)  
Target
Name:
Integrin alpha-IIb/beta-3
Synonyms:
Glycoprotein IIb/IIIa
Type:
Mol. Mass.:
Description:
ASSAY_ID of EBI is 30109
Components:
This complex has 2 components.
Component 1
Name:
Integrin beta-3
Synonyms:
CD_antigen=CD61 GPIIIa ITGB3 Platelet membrane glycoprotein IIIa
Type:
Protein
Mol. Mass.:
87038.91
Organism:
Homo sapiens (Human)
Description:
P05106
Residue:
788
  
Component 2
Name:
Integrin alpha-IIb
Synonyms:
CD_antigen=CD41 GPIIb Glycoprotein IIb ITGA2B Integrin alpha-IIb heavy chain Integrin alpha-IIb light chain, form 2 Integrin alpha-V/beta-3 and alpha-IIb/beta 3 | Platelet membrane glycoprotein IIb
Type:
Protein
Mol. Mass.:
113354.85
Organism:
Homo sapiens (Human)
Description:
P08514
Residue:
1039
  
Inhibitor
Name:
BDBM50107402
Synonyms:
(S)-2-[2-((S)-2-Amino-5-carbamimidoyl-pentanoylamino)-acetylamino]-succinic acid 2-[2-(2-Amino-5-guanidino-pentanoylamino)-acetylamino]-succinic acid(RGD) | CHEMBL313763
Type:
Small organic molecule
Emp. Form.:
C12H22N6O6
Mol. Mass.:
346.3397
SMILES:
N[C@@H](CCCNC(N)=N)C(=O)NCC(=O)N[C@@H](CC(O)=O)C(O)=O
: