Target
Sodium-dependent neutral amino acid transporter B(0)AT2
Ligand
BDBM50007465
Substrate
Meas. Tech.
ChEMBL_1432515 (CHEMBL3386947)
IC50
4900±n/a nM
Citation
 Cuboni, SDevigny, CHoogeland, BStrasser, APomplun, SHauger, BHöfner, GWanner, KTEder, MBuschauer, AHolsboer, FHausch, F Loratadine and analogues: discovery and preliminary structure-activity relationship of inhibitors of the amino acid transporter B(0)AT2. J Med Chem 57:9473-9 (2014)  
Target
Name:
Sodium-dependent neutral amino acid transporter B(0)AT2
Synonyms:
B0AT2 NTT73 SBAT1 Sodium- and chloride-dependent neurotransmitter transporter NTT73 Sodium-dependent neutral amino acid transporter B(0)AT2 Transporter v7-3
Type:
PROTEIN
Mol. Mass.:
81820.70
Organism:
Homo sapiens (Human)
Description:
ChEMBL_109513
Residue:
730
  
Inhibitor
Name:
BDBM50007465
Synonyms:
1-[4-(8-Chloro-5,6-dihydro-benzo[5,6]cyclohepta[1,2-b]pyridin-11-ylidene)-piperidin-1-yl]-butan-1-one | CHEMBL331603
Type:
Small organic molecule
Emp. Form.:
C23H25ClN2O
Mol. Mass.:
380.91
SMILES:
[#6]-[#6]-[#6]-[#6](=O)-[#7]-1-[#6]-[#6]\[#6](-[#6]-[#6]-1)=[#6]-1/c2ccc(Cl)cc2-[#6]-[#6]-c2cccnc-12
: