Target
Sodium-dependent neutral amino acid transporter B(0)AT2
Ligand
BDBM50031232
Substrate
Meas. Tech.
ChEMBL_1432515 (CHEMBL3386947)
IC50
14800±n/a nM
Citation
 Cuboni, SDevigny, CHoogeland, BStrasser, APomplun, SHauger, BHöfner, GWanner, KTEder, MBuschauer, AHolsboer, FHausch, F Loratadine and analogues: discovery and preliminary structure-activity relationship of inhibitors of the amino acid transporter B(0)AT2. J Med Chem 57:9473-9 (2014)  
Target
Name:
Sodium-dependent neutral amino acid transporter B(0)AT2
Synonyms:
B0AT2 NTT73 SBAT1 Sodium- and chloride-dependent neurotransmitter transporter NTT73 Sodium-dependent neutral amino acid transporter B(0)AT2 Transporter v7-3
Type:
PROTEIN
Mol. Mass.:
81820.70
Organism:
Homo sapiens (Human)
Description:
ChEMBL_109513
Residue:
730
  
Inhibitor
Name:
BDBM50031232
Synonyms:
CHEMBL3357028
Type:
Small organic molecule
Emp. Form.:
C22H23ClN2O2
Mol. Mass.:
382.883
SMILES:
CCOC(=O)N1CCC(=CC1)C1c2ccc(Cl)cc2CCc2cccnc12
: