Target
cGMP-specific 3',5'-cyclic phosphodiesterase
Ligand
BDBM50035652
Substrate
Meas. Tech.
ChEMBL_1434379 (CHEMBL3387066)
IC50
2.0±n/a nM
Citation
 Sakamoto, TKoga, YHikota, MMatsuki, KMurakami, MKikkawa, KFujishige, KKotera, JOmori, KMorimoto, HYamada, K Design and synthesis of novel 5-(3,4,5-trimethoxybenzoyl)-4-aminopyrimidine derivatives as potent and selective phosphodiesterase 5 inhibitors: scaffold hopping using a pseudo-ring by intramolecular hydrogen bond formation. Bioorg Med Chem Lett 24:5175-80 (2014)  
Target
Name:
cGMP-specific 3',5'-cyclic phosphodiesterase
Synonyms:
CGB-PDE PDE5A Phosphodiesterase 5A cGMP-specific 3',5'-cyclic phosphodiesterase
Type:
PROTEIN
Mol. Mass.:
98285.03
Organism:
Canis lupus familiaris
Description:
ChEMBL_105565
Residue:
865
  
Inhibitor
Name:
BDBM50035652
Synonyms:
CHEMBL3338443
Type:
Small organic molecule
Emp. Form.:
C32H34N2O7
Mol. Mass.:
558.6216
SMILES:
COC(=O)c1nc(N2CCC(O)CC2)c2cc(OCc3ccccc3)ccc2c1-c1cc(OC)c(OC)c(OC)c1
: