Target
Nuclear receptor ROR-gamma
Ligand
BDBM50035910
Substrate
Meas. Tech.
ChEMBL_1442780 (CHEMBL3375302)
IC50
7.0±n/a nM
Citation
 van Niel, MBFauber, BPCartwright, MGaines, SKillen, JCRené, OWard, SIde Leon Boenig, GDeng, YEidenschenk, CEverett, CGancia, EGanguli, AGobbi, AHawkins, JJohnson, ARKiefer, JRLa, HLockey, PNorman, MOuyang, WQin, AWakes, NWaszkowycz, BWong, H A reversed sulfonamide series of selective RORc inverse agonists. Bioorg Med Chem Lett 24:5769-76 (2014)  
Target
Name:
Nuclear receptor ROR-gamma
Synonyms:
NR1F3 Nuclear receptor ROR-gamma (RORC) RAR-related orphan receptor C (RORc) RORG RZRG Retinoid-related orphan receptor-gamma (RORc)
Type:
Enzyme Catalytic Domain
Mol. Mass.:
58218.40
Organism:
Homo sapiens (Human)
Description:
P51449
Residue:
518
  
Inhibitor
Name:
BDBM50035910
Synonyms:
CHEMBL3361053
Type:
Small organic molecule
Emp. Form.:
C25H31F3N2O5S2
Mol. Mass.:
560.649
SMILES:
CC(C)CN(Cc1ccccc1C(F)(F)F)S(=O)(=O)c1ccc(cc1)C(=O)C1CCN(CC1)S(C)(=O)=O
: