Target
cGMP-specific 3',5'-cyclic phosphodiesterase
Ligand
BDBM50036625
Substrate
Meas. Tech.
ChEMBL_1433727 (CHEMBL3386398)
IC50
1.2±n/a nM
Citation
 Sakamoto, TKoga, YHikota, MMatsuki, KMurakami, MKikkawa, KFujishige, KKotera, JOmori, KMorimoto, HYamada, K The discovery of avanafil for the treatment of erectile dysfunction: a novel pyrimidine-5-carboxamide derivative as a potent and highly selective phosphodiesterase 5 inhibitor. Bioorg Med Chem Lett 24:5460-5 (2015)  
Target
Name:
cGMP-specific 3',5'-cyclic phosphodiesterase
Synonyms:
CGB-PDE PDE5A Phosphodiesterase 5A cGMP-specific 3',5'-cyclic phosphodiesterase
Type:
PROTEIN
Mol. Mass.:
98285.03
Organism:
Canis lupus familiaris
Description:
ChEMBL_105565
Residue:
865
  
Inhibitor
Name:
BDBM50036625
Synonyms:
CHEMBL3354279
Type:
Small organic molecule
Emp. Form.:
C24H27ClN6O3
Mol. Mass.:
482.963
SMILES:
COc1ccc(CNc2nc(ncc2C(=O)NCc2ccccn2)N2CCC[C@H]2CO)cc1Cl
: