Target
cGMP-specific 3',5'-cyclic phosphodiesterase
Ligand
BDBM50036632
Substrate
Meas. Tech.
ChEMBL_1433727 (CHEMBL3386398)
IC50
1.8±n/a nM
Citation
 Sakamoto, TKoga, YHikota, MMatsuki, KMurakami, MKikkawa, KFujishige, KKotera, JOmori, KMorimoto, HYamada, K The discovery of avanafil for the treatment of erectile dysfunction: a novel pyrimidine-5-carboxamide derivative as a potent and highly selective phosphodiesterase 5 inhibitor. Bioorg Med Chem Lett 24:5460-5 (2015)  
Target
Name:
cGMP-specific 3',5'-cyclic phosphodiesterase
Synonyms:
CGB-PDE PDE5A Phosphodiesterase 5A cGMP-specific 3',5'-cyclic phosphodiesterase
Type:
PROTEIN
Mol. Mass.:
98285.03
Organism:
Canis lupus familiaris
Description:
ChEMBL_105565
Residue:
865
  
Inhibitor
Name:
BDBM50036632
Synonyms:
CHEMBL3354284
Type:
Small organic molecule
Emp. Form.:
C24H32ClN5O4
Mol. Mass.:
489.995
SMILES:
COc1ccc(CNc2nc(ncc2C(=O)N[C@H]2CC[C@H](O)CC2)N2CCC[C@H]2CO)cc1Cl
: