Target
Sodium-dependent proline transporter
Ligand
BDBM50052720
Substrate
Meas. Tech.
ChEMBL_1456629 (CHEMBL3370229)
IC50
76±n/a nM
Citation
 Zipp, GGBarbosa, JGreen, MATerranova, KMFink, CYu, XCNouraldeen, AWilson, ASavelieva, KLanthorn, THDavid Kimball, S Novel inhibitors of the high-affinity L-proline transporter as potential therapeutic agents for the treatment of cognitive disorders. Bioorg Med Chem Lett 24:3886-90 (2014)  
Target
Name:
Sodium-dependent proline transporter
Synonyms:
PROT SLC6A7 Solute carrier family 6 member 7
Type:
PROTEIN
Mol. Mass.:
70910.83
Organism:
Homo sapiens (Human)
Description:
ChEMBL_109456
Residue:
636
  
Inhibitor
Name:
BDBM50052720
Synonyms:
CHEMBL3318576
Type:
Small organic molecule
Emp. Form.:
C22H21ClN4O2
Mol. Mass.:
408.881
SMILES:
OCC1CN(CCN1C(=O)c1ccc(cc1)-c1cccc(Cl)c1)c1ncccn1
: