Target
Sodium-dependent proline transporter
Ligand
BDBM50052727
Substrate
Meas. Tech.
ChEMBL_1456629 (CHEMBL3370229)
IC50
1340±n/a nM
Citation
 Zipp, GGBarbosa, JGreen, MATerranova, KMFink, CYu, XCNouraldeen, AWilson, ASavelieva, KLanthorn, THDavid Kimball, S Novel inhibitors of the high-affinity L-proline transporter as potential therapeutic agents for the treatment of cognitive disorders. Bioorg Med Chem Lett 24:3886-90 (2014)  
Target
Name:
Sodium-dependent proline transporter
Synonyms:
PROT SLC6A7 Solute carrier family 6 member 7
Type:
PROTEIN
Mol. Mass.:
70910.83
Organism:
Homo sapiens (Human)
Description:
ChEMBL_109456
Residue:
636
  
Inhibitor
Name:
BDBM50052727
Synonyms:
CHEMBL3318583
Type:
Small organic molecule
Emp. Form.:
C22H19ClN4O
Mol. Mass.:
390.865
SMILES:
Clc1cccc(c1)-c1ccc(cc1)C(=O)N1CC2CC1CN2c1ncccn1
: