Target
Tyrosine-protein phosphatase non-receptor type 11
Ligand
BDBM50054322
Substrate
Meas. Tech.
ChEMBL_1458320 (CHEMBL3369282)
IC50
>20000±n/a nM
Citation
 Zeng, LFZhang, RYYu, ZHLi, SWu, LGunawan, AMLane, BSMali, RSLi, XChan, RJKapur, RWells, CDZhang, ZY Therapeutic potential of targeting the oncogenic SHP2 phosphatase. J Med Chem 57:6594-609 (2014)  
Target
Name:
Tyrosine-protein phosphatase non-receptor type 11
Synonyms:
3.1.3.48 PTP-1D PTP2C Protein Tyrosine Phosphatase PPN11/Shp2 Protein-Tyrosine Phosphatase SHP-2 Protein-tyrosine phosphatase 2C SH-PTP3 SHP2 Src homology phosphatase 2 (SHP-2) Tyrosine-protein phosphatase non-receptor type 11 (SHP-2) | Tyrosine-protein phosphatase non-receptor type 11 (SHP2)
Type:
Protein phosphatase
Mol. Mass.:
68443.59
Organism:
Homo sapiens (Human)
Description:
Q06124
Residue:
593
  
Inhibitor
Name:
BDBM50054322
Synonyms:
CHEMBL3319392 | US9522881, 11c-10 (L88N40)
Type:
Small organic molecule
Emp. Form.:
C27H30IN3O5
Mol. Mass.:
603.4487
SMILES:
CCCN(CC1CC1)C(=O)CCC(=O)Nc1cccc(c1)-c1c(I)c2cc(C(O)=O)c(O)cc2n1C
: