Target
P2Y purinoceptor 12
Ligand
BDBM50100273
Substrate
Meas. Tech.
ChEMBL_1454018 (CHEMBL3367077)
IC50
24±n/a nM
Citation
 Boldron, CBesse, ABordes, MFTissandié, SYvon, XGau, BBadorc, ARousseaux, TBarré, GMeneyrol, JZech, GNazare, MFossey, VPflieger, AMBonnet-Lignon, SMillet, LBriot, CDol, FHérault, JPSavi, PLassalle, GDelesque, NHerbert, JMBono, F N-[6-(4-butanoyl-5-methyl-1H-pyrazol-1-yl)pyridazin-3-yl]-5-chloro-1-[2-(4-methylpiperazin-1-yl)-2-oxoethyl]-1H-indole-3-carboxamide (SAR216471), a novel intravenous and oral, reversible, and directly acting P2Y12 antagonist. J Med Chem 57:7293-316 (2014)  
Target
Name:
P2Y purinoceptor 12
Synonyms:
ADP-glucose receptor HORK3 P2T(AC) P2Y(AC) P2Y(cyc) P2Y12 platelet ADP receptor Purinergic receptor P2Y12 | SP1999
Type:
Enzyme
Mol. Mass.:
39458.48
Organism:
Homo sapiens (Human)
Description:
Q9H244
Residue:
342
  
Inhibitor
Name:
BDBM50100273
Synonyms:
CHEMBL3326905
Type:
Small organic molecule
Emp. Form.:
C28H30N4O4
Mol. Mass.:
486.5622
SMILES:
CCCC(=O)c1cnn(c1C)-c1ccc(NC(=O)c2cn(CCCC(O)=O)c3ccc(C)cc23)cc1
: