Target
Lysophosphatidic acid receptor 3
Ligand
BDBM50148348
Substrate
Meas. Tech.
ChEMBL_1451389 (CHEMBL3363673)
EC50
830±n/a nM
Citation
 Patil, RFells, JISzabó, ELim, KGNorman, DDBalogh, APatil, SStrobos, JMiller, DDTigyi, GJ Design and synthesis of sulfamoyl benzoic acid analogues with subnanomolar agonist activity specific to the LPA2 receptor. J Med Chem 57:7136-40 (2014)  
Target
Name:
Lysophosphatidic acid receptor 3
Synonyms:
EDG7 LPAR3 Lysophosphatidic acid receptor 1/3 Lysophosphatidic acid receptor Edg-7
Type:
Enzyme
Mol. Mass.:
40149.72
Organism:
Homo sapiens (Human)
Description:
Q9UBY5
Residue:
353
  
Inhibitor
Name:
BDBM50148348
Synonyms:
(R)-Octadec-9-enoic acid 2-hydroxy-3-phosphonooxy-propyl ester CHEMBL117021 | lysophosphatidic acid
Type:
Small organic molecule
Emp. Form.:
C21H41O7P
Mol. Mass.:
436.5198
SMILES:
CCCCCCCC\C=C/CCCCCCCC(=O)OC[C@@H](O)COP(O)(O)=O
: