Target
Inosine-5'-monophosphate dehydrogenase
Ligand
BDBM81428
Substrate
Meas. Tech.
ChEMBL_1452433 (CHEMBL3362457)
Ki
13±n/a nM
Citation
 Mandapati, KGorla, SKHouse, ALMcKenney, ESZhang, MRao, SNGollapalli, DRMann, BJGoldberg, JBCuny, GDGlomski, IJHedstrom, L Repurposing cryptosporidium inosine 5'-monophosphate dehydrogenase inhibitors as potential antibacterial agents. ACS Med Chem Lett 5:846-50 (2014)  
Target
Name:
Inosine-5'-monophosphate dehydrogenase
Synonyms:
Cgd6_20 protein Inosine-5'-monophosphate dehydrogenase, probable | Inosine-5-monophosphate dehydrogenase (IMPDH)
Type:
Protein
Mol. Mass.:
43076.80
Organism:
Cryptosporidium parvum
Description:
Q8T6T2
Residue:
400
  
Inhibitor
Name:
BDBM81428
Synonyms:
N-(naphthalen-2-yl)-2-[2-(pyridin-2-yl)-1H-1,3-benzodiazol-1-yl]acetamide, Compound C91
Type:
Small organic molecule
Emp. Form.:
C24H18N4O
Mol. Mass.:
378.4259
SMILES:
O=C(Cn1c(nc2ccccc12)-c1ccccn1)Nc1ccc2ccccc2c1
: