Target
Inosine-5'-monophosphate dehydrogenase
Ligand
BDBM50398417
Substrate
Meas. Tech.
ChEMBL_1452430 (CHEMBL3362092)
IC50
4.0±n/a nM
Citation
 Mandapati, KGorla, SKHouse, ALMcKenney, ESZhang, MRao, SNGollapalli, DRMann, BJGoldberg, JBCuny, GDGlomski, IJHedstrom, L Repurposing cryptosporidium inosine 5'-monophosphate dehydrogenase inhibitors as potential antibacterial agents. ACS Med Chem Lett 5:846-50 (2014)  
Target
Name:
Inosine-5'-monophosphate dehydrogenase
Synonyms:
Cgd6_20 protein Inosine-5'-monophosphate dehydrogenase, probable | Inosine-5-monophosphate dehydrogenase (IMPDH)
Type:
Protein
Mol. Mass.:
43076.80
Organism:
Cryptosporidium parvum
Description:
Q8T6T2
Residue:
400
  
Inhibitor
Name:
BDBM50398417
Synonyms:
CHEMBL2178652
Type:
Small organic molecule
Emp. Form.:
C20H20ClF3N2O
Mol. Mass.:
396.834
SMILES:
CC(=C)c1cccc(c1)C(C)(C)NC(=O)Nc1ccc(Cl)c(c1)C(F)(F)F
: