Target
Renin
Ligand
BDBM50065395
Substrate
Meas. Tech.
ChEMBL_1465911 (CHEMBL3406559)
Ki
2.0±n/a nM
Citation
 McKittrick, BACaldwell, JPBara, TBoykow, GChintala, MClader, JCzarniecki, MCourneya, BDuffy, RFleming, LGiessert, RGreenlee, WJHeap, CHong, LHuang, YIserloh, UJosien, HKhan, TKorfmacher, WLiang, XMazzola, RMitra, SMoore, KOrth, PRajagopalan, MRoy, SSakwa, SStrickland, CVaccaro, HVoigt, JWang, HWong, JZhang, RZych, A Iminopyrimidinones: a novel pharmacophore for the development of orally active renin inhibitors. Bioorg Med Chem Lett 25:1592-6 (2015)  
Target
Name:
Renin
Synonyms:
Angiotensinogenase RENI_HUMAN
Type:
Enzyme
Mol. Mass.:
45058.99
Organism:
Homo sapiens (Human)
Description:
Residue:
406
  
Inhibitor
Name:
BDBM50065395
Synonyms:
CHEMBL3401345
Type:
Small organic molecule
Emp. Form.:
C25H29ClN4O2
Mol. Mass.:
452.976
SMILES:
CC(C)[C@]1(C)CC(=O)N(Cc2cccc(c2)N2CC(CC2=O)c2cccc(Cl)c2)C(=N)N1
: