Target
cGMP-specific 3',5'-cyclic phosphodiesterase
Ligand
BDBM50065690
Substrate
Meas. Tech.
ChEMBL_1464664 (CHEMBL3406685)
IC50
3.3±n/a nM
Citation
 Sakamoto, TKoga, YHikota, MMatsuki, KMochida, HKikkawa, KFujishige, KKotera, JOmori, KMorimoto, HYamada, K 8-(3-chloro-4-methoxybenzyl)-8H-pyrido[2,3-d]pyrimidin-7-one derivatives as potent and selective phosphodiesterase 5 inhibitors. Bioorg Med Chem Lett 25:1431-5 (2015)  
Target
Name:
cGMP-specific 3',5'-cyclic phosphodiesterase
Synonyms:
CGB-PDE PDE5A Phosphodiesterase 5A cGMP-specific 3',5'-cyclic phosphodiesterase
Type:
PROTEIN
Mol. Mass.:
98285.03
Organism:
Canis lupus familiaris
Description:
ChEMBL_105565
Residue:
865
  
Inhibitor
Name:
BDBM50065690
Synonyms:
CHEMBL3404010
Type:
Small organic molecule
Emp. Form.:
C20H21ClN4O3
Mol. Mass.:
400.859
SMILES:
COc1ccc(Cn2c3nc(ncc3ccc2=O)N2CCC[C@H]2CO)cc1Cl
: