Target
Prostaglandin G/H synthase 2
Ligand
BDBM50068351
Substrate
Meas. Tech.
ChEMBL_1466489 (CHEMBL3406799)
IC50
24600±n/a nM
Citation
 Sarigol, DUzgoren-Baran, ATel, BCSomuncuoglu, EIKazkayasi, IOzadali-Sari, KUnsal-Tan, OOkay, GErtan, MTozkoparan, B Novel thiazolo[3,2-b]-1,2,4-triazoles derived from naproxen with analgesic/anti-inflammatory properties: Synthesis, biological evaluation and molecular modeling studies. Bioorg Med Chem 23:2518-28 (2015)  
Target
Name:
Prostaglandin G/H synthase 2
Synonyms:
COX2 Cyclooxygenase 2 (COX-2) Cyclooxygenase-2 (COX-2 AA) Cyclooxygenase-2 (COX-2) PGH2_HUMAN PHS II Prostaglandin E synthase/G/H synthase 2 Prostaglandin-endoperoxide synthase 2
Type:
Enzyme
Mol. Mass.:
69003.89
Organism:
Homo sapiens (Human)
Description:
Recombinant Cox-2 provided by Cayman (Cayman Chemical Co.,Ann Arbor, MI).
Residue:
604
  
Inhibitor
Name:
BDBM50068351
Synonyms:
CHEMBL3402317
Type:
Small organic molecule
Emp. Form.:
C27H23N3O2S
Mol. Mass.:
453.555
SMILES:
COc1ccc2cc(ccc2c1)C(C)c1nc2s\c(=C/C(/C)=C/c3ccccc3)c(=O)n2n1
: