Target
Amine oxidase [flavin-containing] A
Ligand
BDBM50075958
Substrate
Meas. Tech.
ChEMBL_1473802 (CHEMBL3418527)
IC50
3.9±n/a nM
Citation
 Huleatt, PBKhoo, MLChua, YYTan, TWLiew, RSBalogh, BDeme, RGölöncsér, FMagyar, KSheela, DPHo, HKSperlágh, BMátyus, PChai, CL Novel arylalkenylpropargylamines as neuroprotective, potent, and selective monoamine oxidase B inhibitors for the treatment of Parkinson's disease. J Med Chem 58:1400-19 (2015)  
Target
Name:
Amine oxidase [flavin-containing] A
Synonyms:
AOFA_HUMAN MAO-A Monoamine oxidase Monoamine oxidase type A (MAO A) Monoamine oxidase type A (MAOA)
Type:
Protein
Mol. Mass.:
59689.53
Organism:
Homo sapiens (Human)
Description:
P21397
Residue:
527
  
Inhibitor
Name:
BDBM50075958
Synonyms:
CHEMBL3415793
Type:
Small organic molecule
Emp. Form.:
C15H16ClNO4
Mol. Mass.:
309.745
SMILES:
OC(=O)C([O-])=O.C[NH+](CC#C)CC(=C)c1ccc(Cl)cc1
: