Target
Potassium voltage-gated channel subfamily H member 2
Ligand
BDBM50077887
Substrate
Meas. Tech.
ChEMBL_1473398 (CHEMBL3419515)
IC50
>10000±n/a nM
Citation
 Díaz, JLChristmann, UFernández, ATorrens, APort, APascual, RÁlvarez, IBurgueño, JMonroy, XMontero, ABalada, AVela, JMAlmansa, C Synthesis and structure-activity relationship study of a new series of selectives(1) receptor ligands for the treatment of pain: 4-aminotriazoles. J Med Chem 58:2441-51 (2015)  
Target
Name:
Potassium voltage-gated channel subfamily H member 2
Synonyms:
1,3-beta-glucan synthase component GLS2 ERG Eag-related protein 1 Ether-a-go-go-related gene (HERG) Ether-a-go-go-related gene potassium channel 1 Ether-a-go-go-related gene potassium channel 1 (hERG1) Ether-a-go-go-related protein 1 H-ERG KCNH2 Potassium voltage-gated channel subfamily H member 2 (hERG) Voltage-gated potassium channel subunit Kv11.1 hERG Potassium Channel 1 | putative potassium channel subunit
Type:
Multi-pass membrane protein
Mol. Mass.:
126672.65
Organism:
Homo sapiens (Human)
Description:
Q12809
Residue:
1159
  
Inhibitor
Name:
BDBM50077887
Synonyms:
CHEMBL3417059 | US9611229, 17
Type:
Small organic molecule
Emp. Form.:
C16H22FN5
Mol. Mass.:
303.3778
SMILES:
Fc1ccc(Cn2cc(NCCN3CCCCC3)nn2)cc1
: