Target
Sigma non-opioid intracellular receptor 1
Ligand
BDBM50077887
Substrate
Meas. Tech.
ChEMBL_1473395 (CHEMBL3419512)
Ki
52±n/a nM
Citation
 Díaz, JLChristmann, UFernández, ATorrens, APort, APascual, RÁlvarez, IBurgueño, JMonroy, XMontero, ABalada, AVela, JMAlmansa, C Synthesis and structure-activity relationship study of a new series of selectives(1) receptor ligands for the treatment of pain: 4-aminotriazoles. J Med Chem 58:2441-51 (2015)  
Target
Name:
Sigma non-opioid intracellular receptor 1
Synonyms:
Aging-associated gene 8 protein SGMR1_HUMAN SIGMAR1 SR31747-binding protein Sigma 1-type opioid receptor Sigma1R | hSigmaR1
Type:
Enzyme Catalytic Domain
Mol. Mass.:
25124.85
Organism:
Homo sapiens (Human)
Description:
Q99720
Residue:
223
  
Inhibitor
Name:
BDBM50077887
Synonyms:
CHEMBL3417059 | US9611229, 17
Type:
Small organic molecule
Emp. Form.:
C16H22FN5
Mol. Mass.:
303.3778
SMILES:
Fc1ccc(Cn2cc(NCCN3CCCCC3)nn2)cc1
: