Target
Glucagon-like peptide 1 receptor
Ligand
BDBM50086588
Substrate
Meas. Tech.
ChEMBL_1477109 (CHEMBL3428276)
Ki
17±n/a nM
Citation
 Hoang, HNSong, KHill, TADerksen, DREdmonds, DJKok, WMLimberakis, CLiras, SLoria, PMMascitti, VMathiowetz, AMMitchell, JMPiotrowski, DWPrice, DAStanton, RVSuen, JYWithka, JMGriffith, DAFairlie, DP Short Hydrophobic Peptides with Cyclic Constraints Are Potent Glucagon-like Peptide-1 Receptor (GLP-1R) Agonists. J Med Chem 58:4080-5 (2015)  
Target
Name:
Glucagon-like peptide 1 receptor
Synonyms:
GLP-1 receptor GLP-1R GLP1R_HUMAN Glucagon-like peptide 1 receptor (GLP-1)
Type:
Enzyme
Mol. Mass.:
53035.78
Organism:
Homo sapiens (Human)
Description:
P43220
Residue:
463
  
Inhibitor
Name:
BDBM50086588
Synonyms:
CHEMBL3426243
Type:
Small organic molecule
Emp. Form.:
C74H98FN15O17
Mol. Mass.:
1488.6586
SMILES:
[H][C@]1(NC(=O)[C@](C)(Cc2ccccc2F)NC(=O)[C@H](CCCCNC(=O)CC[C@H](NC(=O)[C@H](CO)NC1=O)C(=O)N[C@@H](Cc1ccc(cc1)-c1ccc(OC)cc1CC)C(=O)N[C@@H](CCCc1ccccc1)C(N)=O)NC(=O)CNC(=O)[C@H](CCC(O)=O)NC(=O)C(C)(C)NC(=O)[C@@H](N)Cc1cnc[nH]1)[C@@H](C)O
: