Target
Scavenger receptor class B member 1
Ligand
BDBM50088271
Substrate
Meas. Tech.
ChEMBL_1476710 (CHEMBL3429061)
IC50
380±n/a nM
Citation
 Dockendorff, CFaloon, PWGermain, AYu, MYoungsaye, WNag, PPBennion, MPenman, MNieland, TJDandapani, SPerez, JRMunoz, BPalmer, MASchreiber, SLKrieger, M Discovery of bisamide-heterocycles as inhibitors of scavenger receptor BI (SR-BI)-mediated lipid uptake. Bioorg Med Chem Lett 25:2594-8 (2015)  
Target
Name:
Scavenger receptor class B member 1
Synonyms:
SCRB1_MOUSE Scarb1 Srb1
Type:
PROTEIN
Mol. Mass.:
56761.39
Organism:
Mus musculus
Description:
ChEMBL_103999
Residue:
509
  
Inhibitor
Name:
BDBM50088271
Synonyms:
CHEMBL3427485
Type:
Small organic molecule
Emp. Form.:
C23H31FN6O2
Mol. Mass.:
442.5296
SMILES:
CC(N(C1CCCCC1)C(=O)Cn1nnc(n1)-c1cccc(F)c1)C(=O)NC1CCCC1
: