Target
Angiotensin-converting enzyme
Ligand
BDBM50093599
Substrate
Meas. Tech.
ChEMBL_1501476 (CHEMBL3586838)
IC50
100±n/a nM
Citation
 Jallapally, AAddla, DBagul, PSridhar, BBanerjee, SKKantevari, S Design, synthesis and evaluation of novel 2-butyl-4-chloroimidazole derived peptidomimetics as Angiotensin Converting Enzyme (ACE) inhibitors. Bioorg Med Chem 23:3526-33 (2015)  
Target
Name:
Angiotensin-converting enzyme
Synonyms:
3.2.1.- ACE Angiotensin-converting enzyme, soluble form DCP1 Kininase II
Type:
Mol. Mass.:
150405.15
Organism:
Oryctolagus cuniculus
Description:
Residue:
1310
  
Inhibitor
Name:
BDBM50093599
Synonyms:
CHEMBL3585803
Type:
Small organic molecule
Emp. Form.:
C18H22ClN3O3
Mol. Mass.:
363.839
SMILES:
CCCCc1nc(Cl)c(C(=O)N[C@@H](Cc2ccccc2)C(O)=O)n1C
: