Target
Dual specificity tyrosine-phosphorylation-regulated kinase 1A
Ligand
BDBM50445253
Substrate
Meas. Tech.
ChEMBL_1508046 (CHEMBL3599536)
IC50
240±n/a nM
Citation
 Yadav, RRSharma, SJoshi, PWani, AVishwakarma, RAKumar, ABharate, SB Meridianin derivatives as potent Dyrk1A inhibitors and neuroprotective agents. Bioorg Med Chem Lett 25:2948-52 (2015)  
Target
Name:
Dual specificity tyrosine-phosphorylation-regulated kinase 1A
Synonyms:
DYR1A_HUMAN DYRK1A Dual specificity YAK1-related kinase 1A (Dyrk1A) Dual-specificity tyrosine-phosphorylation regulated kinase 1A HP86 MNBH
Type:
Enzyme
Mol. Mass.:
85616.61
Organism:
Homo sapiens (Human)
Description:
Q13627
Residue:
763
  
Inhibitor
Name:
BDBM50445253
Synonyms:
CHEMBL1232500
Type:
Small organic molecule
Emp. Form.:
C12H13NO2S
Mol. Mass.:
235.302
SMILES:
CCN1C(Sc2ccc(O)cc12)=CC(C)=O
: