Target
Cyclin-dependent kinase 2
Ligand
BDBM6301
Substrate
Meas. Tech.
ChEMBL_1510330 (CHEMBL3606998)
IC50
439±n/a nM
Citation
 Sánchez-Martínez, CGelbert, LMLallena, MJde Dios, A Cyclin dependent kinase (CDK) inhibitors as anticancer drugs. Bioorg Med Chem Lett 25:3420-35 (2015)  
Target
Name:
Cyclin-dependent kinase 2
Synonyms:
CDK2 CDK2_HUMAN Cell division protein kinase 2 Protein cereblon/Cyclin-dependent kinase 2 | p33 protein kinase
Type:
Enzyme Subunit
Mol. Mass.:
33938.17
Organism:
Homo sapiens (Human)
Description:
P24941
Residue:
298
  
Inhibitor
Name:
BDBM6301
Synonyms:
6-bromo-8-cyclopentyl-5-methyl-2-{[4-(piperazin-1-yl)phenyl]amino}-7H,8H-pyrido[2,3-d]pyrimidin-7-one pyrido[2,3-d]pyrimidin-7-one 29
Type:
Small organic molecule
Emp. Form.:
C23H27BrN6O
Mol. Mass.:
483.404
SMILES:
Cc1c(Br)c(=O)n(C2CCCC2)c2nc(Nc3ccc(cc3)N3CCNCC3)ncc12
: