Target
Tyrosine-protein phosphatase non-receptor type 11
Ligand
BDBM50420258
Substrate
Meas. Tech.
ChEMBL_1513414 (CHEMBL3611569)
Ki
6600±n/a nM
Citation
 He, RYu, ZHZhang, RYWu, LGunawan, AMLane, BSShim, JSZeng, LFHe, YChen, LWells, CDLiu, JOZhang, ZY Exploring the Existing Drug Space for Novel pTyr Mimetic and SHP2 Inhibitors. ACS Med Chem Lett 6:782-6 (2015)  
Target
Name:
Tyrosine-protein phosphatase non-receptor type 11
Synonyms:
3.1.3.48 PTP-1D PTP2C Protein Tyrosine Phosphatase PPN11/Shp2 Protein-Tyrosine Phosphatase SHP-2 Protein-tyrosine phosphatase 2C SH-PTP3 SHP2 Src homology phosphatase 2 (SHP-2) Tyrosine-protein phosphatase non-receptor type 11 (SHP-2) | Tyrosine-protein phosphatase non-receptor type 11 (SHP2)
Type:
Protein phosphatase
Mol. Mass.:
68443.59
Organism:
Homo sapiens (Human)
Description:
Q06124
Residue:
593
  
Inhibitor
Name:
BDBM50420258
Synonyms:
CEFSULODIN
Type:
Small organic molecule
Emp. Form.:
C22H21N4O8S2
Mol. Mass.:
533.554
SMILES:
NC(=O)c1cc[n+](CC2=C(N3[C@H](SC2)[C@H](NC(=O)C(c2ccccc2)S(O)(=O)=O)C3=O)C(O)=O)cc1
: