Target
Solute carrier family 40 member 1
Ligand
BDBM50120967
Substrate
Meas. Tech.
ChEMBL_1520975 (CHEMBL3624279)
EC50
>600±n/a nM
Citation
 Chua, KFung, EMicewicz, EDGanz, TNemeth, ERuchala, P Small cyclic agonists of iron regulatory hormone hepcidin. Bioorg Med Chem Lett 25:4961-9 (2015)  
Target
Name:
Solute carrier family 40 member 1
Synonyms:
FPN FPN1 IREG1 S40A1_HUMAN SLC40A1 | Solute carrier family 40 member 1
Type:
PROTEIN
Mol. Mass.:
62541.43
Organism:
Homo sapiens (Human)
Description:
ChEMBL_109560
Residue:
571
  
Inhibitor
Name:
BDBM50120967
Synonyms:
CHEMBL3623065
Type:
Small organic molecule
Emp. Form.:
C58H77N15O9S3
Mol. Mass.:
1224.522
SMILES:
[H][C@@]12CCCN1C(=O)[C@H](Cc1ccccc1)NC(=O)[C@H](CSCc1cccc3cccc(CSC[C@H](NC(=O)[C@H](Cc4ccccc4)NC(=O)[C@H](CCCNC(N)=N)NC(=O)[C@H](CS)NC(=O)[C@H](CCCNC(N)=N)NC2=O)C(N)=O)c13)NC(C)=O
: