Target
Cruzipain
Ligand
BDBM50126127
Substrate
Meas. Tech.
ChEMBL_1523287 (CHEMBL3629994)
IC50
3.0±n/a nM
Citation
 Neitz, RJBryant, CChen, SGut, JCaselli, EHPonce, SChowdhury, SXu, HArkin, MREllman, JARenslo, AR Tetrafluorophenoxymethyl ketone cruzain inhibitors with improved pharmacokinetic properties as therapeutic leads for Chagas' disease. Bioorg Med Chem Lett 25:4834-7 (2015)  
Target
Name:
Cruzipain
Synonyms:
CYSP_TRYCR Cruzaine | Major cysteine proteinase
Type:
Protein
Mol. Mass.:
49831.41
Organism:
Trypanosoma cruzi
Description:
P25779
Residue:
467
  
Inhibitor
Name:
BDBM50126127
Synonyms:
CHEMBL3628943
Type:
Small organic molecule
Emp. Form.:
C29H33F4N7O2
Mol. Mass.:
587.6116
SMILES:
CCCCC(C(=O)COc1c(F)c(F)cc(F)c1F)n1cc(nn1)[C@@](C)(NCc1ccn2nccc2n1)C1CCCC1
: