Target
Cocaine esterase
Ligand
BDBM50130884
Substrate
Meas. Tech.
ChEMBL_1525590 (CHEMBL3637216)
IC50
4720±n/a nM
Citation
 Mai, ZPZhou, KGe, GBWang, CHuo, XKDong, PPDeng, SZhang, BJZhang, HLHuang, SSMa, XC Protostane Triterpenoids from the Rhizome of Alisma orientale Exhibit Inhibitory Effects on Human Carboxylesterase 2. J Nat Prod 78:2372-80 (2015)  
Target
Name:
Cocaine esterase
Synonyms:
CES2 EST2_HUMAN | ICE
Type:
PROTEIN
Mol. Mass.:
61801.08
Organism:
Homo sapiens (Human)
Description:
ChEMBL_1494240
Residue:
559
  
Inhibitor
Name:
BDBM50130884
Synonyms:
CHEMBL3632946
Type:
Small organic molecule
Emp. Form.:
C32H54O5
Mol. Mass.:
518.7682
SMILES:
[H][C@@]12CC[C@@]3(C)[C@@]([H])([C@@H](O)CC4=C(CC[C@]34C)[C@H](C)C[C@H](O)[C@@H](O)C(C)(C)OCC)[C@@]1(C)CCC(=O)C2(C)C
: