Target
Cocaine esterase
Ligand
BDBM50130901
Substrate
Meas. Tech.
ChEMBL_1525590 (CHEMBL3637216)
IC50
4580±n/a nM
Citation
 Mai, ZPZhou, KGe, GBWang, CHuo, XKDong, PPDeng, SZhang, BJZhang, HLHuang, SSMa, XC Protostane Triterpenoids from the Rhizome of Alisma orientale Exhibit Inhibitory Effects on Human Carboxylesterase 2. J Nat Prod 78:2372-80 (2015)  
Target
Name:
Cocaine esterase
Synonyms:
CES2 EST2_HUMAN | ICE
Type:
PROTEIN
Mol. Mass.:
61801.08
Organism:
Homo sapiens (Human)
Description:
ChEMBL_1494240
Residue:
559
  
Inhibitor
Name:
BDBM50130901
Synonyms:
CHEMBL3632948
Type:
Small organic molecule
Emp. Form.:
C30H48O3
Mol. Mass.:
456.7003
SMILES:
[H][C@@]1(CC[C@@]2(C)C1=CC=C1[C@@]3(C)CCC(=O)C(C)(C)[C@]3([H])CC[C@]21C)[C@H](C)CC[C@H](O)C(C)(C)O
: