Target
Cocaine esterase
Ligand
BDBM50130903
Substrate
Meas. Tech.
ChEMBL_1525590 (CHEMBL3637216)
IC50
2020±n/a nM
Citation
 Mai, ZPZhou, KGe, GBWang, CHuo, XKDong, PPDeng, SZhang, BJZhang, HLHuang, SSMa, XC Protostane Triterpenoids from the Rhizome of Alisma orientale Exhibit Inhibitory Effects on Human Carboxylesterase 2. J Nat Prod 78:2372-80 (2015)  
Target
Name:
Cocaine esterase
Synonyms:
CES2 EST2_HUMAN | ICE
Type:
PROTEIN
Mol. Mass.:
61801.08
Organism:
Homo sapiens (Human)
Description:
ChEMBL_1494240
Residue:
559
  
Inhibitor
Name:
BDBM50130903
Synonyms:
CHEMBL3632950
Type:
Small organic molecule
Emp. Form.:
C29H46O5
Mol. Mass.:
474.6725
SMILES:
[H][C@@]12CC[C@@]3(C)[C@@]([H])([C@@H](O)CC4=C(CC[C@]34C)[C@H](C)C[C@H](O)[C@@H](O)C(C)(C)O)[C@@]1(C)CC(=O)C=C2C
: