Target
Cocaine esterase
Ligand
BDBM50130904
Substrate
Meas. Tech.
ChEMBL_1525590 (CHEMBL3637216)
IC50
71590±n/a nM
Citation
 Mai, ZPZhou, KGe, GBWang, CHuo, XKDong, PPDeng, SZhang, BJZhang, HLHuang, SSMa, XC Protostane Triterpenoids from the Rhizome of Alisma orientale Exhibit Inhibitory Effects on Human Carboxylesterase 2. J Nat Prod 78:2372-80 (2015)  
Target
Name:
Cocaine esterase
Synonyms:
CES2 EST2_HUMAN | ICE
Type:
PROTEIN
Mol. Mass.:
61801.08
Organism:
Homo sapiens (Human)
Description:
ChEMBL_1494240
Residue:
559
  
Inhibitor
Name:
BDBM50130904
Synonyms:
CHEMBL3632951
Type:
Small organic molecule
Emp. Form.:
C24H32O3
Mol. Mass.:
368.5091
SMILES:
[H][C@@]12CC[C@@]3(C)[C@@]([H])(C=CC4=C(C(C)=O)C(=O)C[C@]34C)[C@@]1(C)CCC(=O)C2(C)C
: