Target
Cocaine esterase
Ligand
BDBM50130911
Substrate
Meas. Tech.
ChEMBL_1525590 (CHEMBL3637216)
IC50
17270±n/a nM
Citation
 Mai, ZPZhou, KGe, GBWang, CHuo, XKDong, PPDeng, SZhang, BJZhang, HLHuang, SSMa, XC Protostane Triterpenoids from the Rhizome of Alisma orientale Exhibit Inhibitory Effects on Human Carboxylesterase 2. J Nat Prod 78:2372-80 (2015)  
Target
Name:
Cocaine esterase
Synonyms:
CES2 EST2_HUMAN | ICE
Type:
PROTEIN
Mol. Mass.:
61801.08
Organism:
Homo sapiens (Human)
Description:
ChEMBL_1494240
Residue:
559
  
Inhibitor
Name:
BDBM50130911
Synonyms:
CHEMBL3632956
Type:
Small organic molecule
Emp. Form.:
C30H46O4
Mol. Mass.:
470.6838
SMILES:
[H][C@]12C[C@@]3(C)C(C=C[C@@]4([H])[C@@]5(C)CCC(=O)C(C)(C)[C@]5([H])CC[C@]34C)=C1[C@H](C)C[C@]([H])(O2)[C@@H](O)C(C)(C)O
: