Target
Cocaine esterase
Ligand
BDBM50130915
Substrate
Meas. Tech.
ChEMBL_1525590 (CHEMBL3637216)
IC50
4030±n/a nM
Citation
 Mai, ZPZhou, KGe, GBWang, CHuo, XKDong, PPDeng, SZhang, BJZhang, HLHuang, SSMa, XC Protostane Triterpenoids from the Rhizome of Alisma orientale Exhibit Inhibitory Effects on Human Carboxylesterase 2. J Nat Prod 78:2372-80 (2015)  
Target
Name:
Cocaine esterase
Synonyms:
CES2 EST2_HUMAN | ICE
Type:
PROTEIN
Mol. Mass.:
61801.08
Organism:
Homo sapiens (Human)
Description:
ChEMBL_1494240
Residue:
559
  
Inhibitor
Name:
BDBM50130915
Synonyms:
CHEBI:3122 | CHEMBL1231178
Type:
Small organic molecule
Emp. Form.:
C12H9N2O8P
Mol. Mass.:
340.1822
SMILES:
OP(=O)(Oc1ccc(cc1)[N+]([O-])=O)Oc1ccc(cc1)[N+]([O-])=O
: