Target
Cocaine esterase
Ligand
BDBM50130918
Substrate
Meas. Tech.
ChEMBL_1525590 (CHEMBL3637216)
IC50
33410±n/a nM
Citation
 Mai, ZPZhou, KGe, GBWang, CHuo, XKDong, PPDeng, SZhang, BJZhang, HLHuang, SSMa, XC Protostane Triterpenoids from the Rhizome of Alisma orientale Exhibit Inhibitory Effects on Human Carboxylesterase 2. J Nat Prod 78:2372-80 (2015)  
Target
Name:
Cocaine esterase
Synonyms:
CES2 EST2_HUMAN | ICE
Type:
PROTEIN
Mol. Mass.:
61801.08
Organism:
Homo sapiens (Human)
Description:
ChEMBL_1494240
Residue:
559
  
Inhibitor
Name:
BDBM50130918
Synonyms:
CHEMBL3632943
Type:
Small organic molecule
Emp. Form.:
C32H48O6
Mol. Mass.:
528.7199
SMILES:
[H][C@@]12CC[C@@]3(C)[C@@]([H])(C=CC4=C([C@H](C)C[C@H](OC(C)=O)[C@H](O)C(C)(C)O)C(=O)C[C@]34C)[C@@]1(C)CCC(=O)C2(C)C
: