Target
Potassium voltage-gated channel subfamily H member 2
Ligand
BDBM50142902
Substrate
Meas. Tech.
ChEMBL_1552682 (CHEMBL3762781)
IC50
16600±n/a nM
Citation
 Hewawasam, PTu, YGao, MHanumegowda, UKnipe, JLemm, JAParker, DDRigat, KLRoberts, SBMeanwell, NAKadow, JF Discovery and preclinical evaluation of potent, orally bioavailable, metabolically stable cyclopropylindolobenzazepine acylsulfonamides as thumb site 1 inhibitors of the hepatitis c virus NS5B RNA-dependent, RNA polymerase. Bioorg Med Chem Lett 26:936-40 (2016)  
Target
Name:
Potassium voltage-gated channel subfamily H member 2
Synonyms:
1,3-beta-glucan synthase component GLS2 ERG Eag-related protein 1 Ether-a-go-go-related gene (HERG) Ether-a-go-go-related gene potassium channel 1 Ether-a-go-go-related gene potassium channel 1 (hERG1) Ether-a-go-go-related protein 1 H-ERG KCNH2 Potassium voltage-gated channel subfamily H member 2 (hERG) Voltage-gated potassium channel subunit Kv11.1 hERG Potassium Channel 1 | putative potassium channel subunit
Type:
Multi-pass membrane protein
Mol. Mass.:
126672.65
Organism:
Homo sapiens (Human)
Description:
Q12809
Residue:
1159
  
Inhibitor
Name:
BDBM50142902
Synonyms:
CHEMBL3760108
Type:
Small organic molecule
Emp. Form.:
C38H48N4O5S
Mol. Mass.:
672.877
SMILES:
[H][C@@]12C[C@@]1(Cn1c(c(C3CCCCC3)c3ccc(cc13)C(=O)NS(=O)(=O)CC(C)C)-c1ccc(OC)cc21)C(=O)N1C2CCC1CN(C)C2
: