Target
Carbonic anhydrase 2
Ligand
BDBM50143979
Substrate
Meas. Tech.
ChEMBL_1551381 (CHEMBL3762502)
Ki
>10000±n/a nM
Citation
 Carradori, SSecci, DDe Monte, CMollica, ACeruso, MAkdemir, ASobolev, APCodispoti, RDe Cosmi, FGuglielmi, PSupuran, CT A novel library of saccharin and acesulfame derivatives as potent and selective inhibitors of carbonic anhydrase IX and XII isoforms. Bioorg Med Chem 24:1095-105 (2016)  
Target
Name:
Carbonic anhydrase 2
Synonyms:
CA-II CAC Carbonate dehydratase II Carbonic anhydrase 2 (CA-II) Carbonic anhydrase C Carbonic anhydrase II (CA-II) Carbonic anhydrase II (hCA II) | Carbonic anhydrase isoenzyme II (hCA II)
Type:
Enzyme
Mol. Mass.:
29250.71
Organism:
Homo sapiens (Human)
Description:
P00918
Residue:
260
  
Inhibitor
Name:
BDBM50143979
Synonyms:
CHEMBL3759331
Type:
Small organic molecule
Emp. Form.:
C14H10ClNO3S
Mol. Mass.:
307.752
SMILES:
Clc1ccc(CN2C(=O)c3ccccc3S2(=O)=O)cc1
: