Target
Induced myeloid leukemia cell differentiation protein Mcl-1
Ligand
BDBM50160061
Substrate
Meas. Tech.
ChEMBL_1565814 (CHEMBL3789421)
Ki
<10±n/a nM
Citation
 Pelz, NFBian, ZZhao, BShaw, STarr, JCBelmar, JGregg, CCamper, DVGoodwin, CMArnold, ALSensintaffar, JLFriberg, ARossanese, OWLee, TOlejniczak, ETFesik, SW Discovery of 2-Indole-acylsulfonamide Myeloid Cell Leukemia 1 (Mcl-1) Inhibitors Using Fragment-Based Methods. J Med Chem 59:2054-66 (2016)  
Target
Name:
Induced myeloid leukemia cell differentiation protein Mcl-1
Synonyms:
BCL2L3 Bcl-2-like protein 3 (Mcl-1) Bcl2-L-3 MCL1 Mcl-1 Myeloid cell leukemia sequence 1 (BCL2-related) | mcl1/EAT
Type:
Membrane; Single-pass membrane protein
Mol. Mass.:
37332.87
Organism:
Homo sapiens (Human)
Description:
Q07820
Residue:
350
  
Inhibitor
Name:
BDBM50160061
Synonyms:
CHEMBL3787158
Type:
Small organic molecule
Emp. Form.:
C39H40Cl2N6O5S
Mol. Mass.:
775.743
SMILES:
Cc1nn(C)c(C)c1-c1c(Cl)ccc2c(CCCOc3cc(C)c(Cl)c(C)c3)c([nH]c12)C(=O)NS(=O)(=O)c1cccc(CNC(=O)c2cccn2C)c1
: